{"text_format":"1","workbook":"xlsx","n_sheets":7,"sheets":["はじめにお読みください ","採点なし","採点付","採点付(名簿) ","商品一覧 (公開模試)","商品パターン","発売日関数用"],"not_rendered":{"charts":0,"images":1,"macros":0,"external_links":13,"defined_names":115,"comments":5,"pivot_tables":0},"unopened":[],"bounds":{"document_bytes":16777216,"sheet_cells":100000,"rows_first":2000,"rows_last":500,"rows_between":2000,"halvings":0,"cell_chars":16384,"cell_head_chars":4096},"cells_cut":0,"cells_raw":0,"read":"whole","date_system":"1900"}

{"sheet":"はじめにお読みください ","index":0,"n_rows":46,"n_cols":3,"rows_kept":46,"cut":false,"hidden":false,"merged":[[41,0,41,2],[12,0,12,1],[13,0,13,1],[22,0,22,1],[23,0,23,1],[17,0,17,2],[18,0,18,2],[40,0,40,2]]}
["【会場試験開催規定】"]
["弊社は、全国統一公開模試会場試験及び基本情報技術者午前免除制度の修了試験において、次号の一つにでも該当する場合は、"]
["申込者及び受講生様に何ら告知することなく、会場試験の全部または一部の開催を中止できるものとします。"]
["この場合、申込者及び受講生様に生じた損害について、弊社は一切の責任を負いません。"]
[]
["１．火災、停電、感染症リスク等により、会場試験の提供ができなくなった場合"]
["２．地震、噴火、洪水、津波等の天災により会場試験の提供ができなくなった場合"]
["３．戦争、暴動、騒乱、労働争議等により会場試験の提供ができなくなった場合"]
["４．会場試験の運営に支障が生じると弊社が判断した場合"]
[]
{"$rows_left_out":37}
{"sheet":"採点なし","index":1,"n_rows":135,"n_cols":47,"rows_kept":135,"cut":false,"hidden":false,"merged":[[134,25,134,27],[134,28,134,32],[137,2,137,22],[141,2,141,12],[142,2,142,12],[134,1,134,3],[134,4,134,7],[134,8,134,11],[134,12,134,15],[134,16,134,19],[134,20,134,22],[132,14,132,32],[133,1,133,3],[133,4,133,7],[133,8,133,11],[133,12,133,15],[133,16,133,19],[133,25,133,27],[133,28,133,32],[130,2,130,16],[130,21,130,22],[130,27,130,29],[130,30,130,32],[131,1,132,2],[131,4,131,8],[131,10,131,12],[131,14,131,32],[132,5,132,8],[132,10,132,12],[123,1,126,18],[123,19,123,22],[123,25,123,26],[123,27,123,29],[123,30,123,32],[124,19,124,22],[124,25,124,26],[124,27,124,29],[124,30,124,32],[125,19,125,22],[125,25,125,26],[125,27,125,29],[125,30,125,32],[128,1,128,9],[128,17,128,20],[128,21,128,22],[128,27,128,29],[128,30,128,32],[129,1,129,16],[129,17,130,20],[129,21,129,22],[129,27,129,29],[129,30,129,32],[120,25,120,26],[120,27,120,29],[120,30,120,32],[121,3,121,15],[121,16,121,18],[121,19,121,21],[121,22,121,24],[121,25,121,26],[121,30,121,32],[122,21,122,32],[116,3,116,18],[116,19,116,21],[116,25,116,26],[116,27,116,29],[116,30,116,32],[117,3,117,18],[117,19,117,21],[117,25,117,26],[117,27,117,29],[117,30,117,32],[121,27,121,29],[118,3,118,18],[118,19,118,21],[118,25,118,26],[118,27,118,29],[118,30,118,32],[119,3,119,18],[119,19,119,21],[119,25,119,26],[119,27,119,29],[119,30,119,32],[120,3,120,18],[120,19,120,21],[114,3,114,18],[114,19,114,21],[114,25,114,26],[114,27,114,29],[114,30,114,32],[115,3,115,18],[115,19,115,21],[115,25,115,26],[115,27,115,29],[115,30,115,32],[112,3,112,18],[112,19,112,21],[112,25,112,26],[112,27,112,29],[112,30,112,32],[113,3,113,18],[113,19,113,21],[113,25,113,26],[113,27,113,29],[113,30,113,32],[110,3,110,18],[110,19,110,21],[110,25,110,26],[110,27,110,29],[110,30,110,32],[111,3,111,18],[111,19,111,21],[111,25,111,26],[111,27,111,29],[111,30,111,32],[108,3,108,18],[108,19,108,21],[108,25,108,26],[108,27,108,29],[108,30,108,32],[109,3,109,18],[109,19,109,21],[109,25,109,26],[109,27,109,29],[109,30,109,32],[106,3,106,18],[106,19,106,21],[106,25,106,26],[106,27,106,29],[106,30,106,32],[107,3,107,18],[107,19,107,21],[107,25,107,26],[107,27,107,29],[107,30,107,32],[104,3,104,18],[104,19,104,21],[104,25,104,26],[104,27,104,29],[104,30,104,32],[105,3,105,18],[105,19,105,21],[105,25,105,26],[105,27,105,29],[105,30,105,32],[102,3,102,18],[102,19,102,21],[102,25,102,26],[102,27,102,29],[102,30,102,32],[103,3,103,18],[103,19,103,21],[103,25,103,26],[103,27,103,29],[103,30,103,32],[100,3,100,18],[100,19,100,21],[100,25,100,26],[100,27,100,29],[100,30,100,32],[101,3,101,18],[101,19,101,21],[101,25,101,26],[101,27,101,29],[101,30,101,32],[98,3,98,18],[98,19,98,21],[98,25,98,26],[98,27,98,29],[98,30,98,32],[99,3,99,18],[99,19,99,21],[99,25,99,26],[99,27,99,29],[99,30,99,32],[96,3,96,18],[96,19,96,21],[96,25,96,26],[96,27,96,29],[96,30,96,32],[97,3,97,18],[97,19,97,21],[97,25,97,26],[97,27,97,29],[97,30,97,32],[94,3,94,18],[94,19,94,21],[94,25,94,26],[94,27,94,29],[94,30,94,32],[95,3,95,18],[95,19,95,21],[95,25,95,26],[95,27,95,29],[95,30,95,32],[92,3,92,18],[92,19,92,21],[92,25,92,26],[92,27,92,29],[92,30,92,32],[93,3,93,18],[93,19,93,21],[93,25,93,26],[93,27,93,29],[93,30,93,32],[90,3,90,18],[90,19,90,21],[90,25,90,26],[90,27,90,29],[90,30,90,32],[91,3,91,18],[91,19,91,21],[91,25,91,26],[91,27,91,29],[91,30,91,32],[88,3,88,18],[88,19,88,21],[88,25,88,26],[88,27,88,29],[88,30,88,32],[89,3,89,18],[89,19,89,21],[89,25,89,26],[89,27,89,29],[89,30,89,32],[86,3,86,18],[86,19,86,21],[86,25,86,26],[86,27,86,29],[86,30,86,32],[87,3,87,18],[87,19,87,21],[87,25,87,26],[87,27,87,29],[87,30,87,32],[84,3,84,18],[84,19,84,21],[84,25,84,26],[84,27,84,29],[84,30,84,32],[85,3,85,18],[85,19,85,21],[85,25,85,26],[85,27,85,29],[85,30,85,32],[82,3,82,18],[82,19,82,21],[82,25,82,26],[82,27,82,29],[82,30,82,32],[83,3,83,18],[83,19,83,21],[83,25,83,26],[83,27,83,29],[83,30,83,32],[80,3,80,18],[80,19,80,21],[80,25,80,26],[80,27,80,29],[80,30,80,32],[81,3,81,18],[81,19,81,21],[81,25,81,26],[81,27,81,29],[81,30,81,32],[78,3,78,18],[78,19,78,21],[78,25,78,26],[78,27,78,29],[78,30,78,32],[79,3,79,18],[79,19,79,21],[79,25,79,26],[79,27,79,29],[79,30,79,32],[76,3,76,18],[76,19,76,21],[76,25,76,26],[76,27,76,29],[76,30,76,32],[77,3,77,18],[77,19,77,21],[77,25,77,26],[77,27,77,29],[77,30,77,32],[74,3,74,18],[74,19,74,21],[74,25,74,26],[74,27,74,29],[74,30,74,32],[75,3,75,18],[75,19,75,21],[75,25,75,26],[75,27,75,29],[75,30,75,32],[72,3,72,18],[72,19,72,21],[72,25,72,26],[72,27,72,29],[72,30,72,32],[73,3,73,18],[73,19,73,21],[73,25,73,26],[73,27,73,29],[73,30,73,32],[70,3,70,18],[70,19,70,21],[70,25,70,26],[70,27,70,29],[70,30,70,32],[71,3,71,18],[71,19,71,21],[71,25,71,26],[71,27,71,29],[71,30,71,32],[68,3,68,18],[68,19,68,21],[68,25,68,26],[68,27,68,29],[68,30,68,32],[69,3,69,18],[69,19,69,21],[69,25,69,26],[69,27,69,29],[69,30,69,32],[66,3,66,18],[66,19,66,21],[66,25,66,26],[66,27,66,29],[66,30,66,32],[67,3,67,18],[67,19,67,21],[67,25,67,26],[67,27,67,29],[67,30,67,32],[64,3,64,18],[64,19,64,21],[64,25,64,26],[64,27,64,29],[64,30,64,32],[65,3,65,18],[65,19,65,21],[65,25,65,26],[65,27,65,29],[65,30,65,32],[62,3,62,18],[62,19,62,21],[62,25,62,26],[62,27,62,29],[62,30,62,32],[63,3,63,18],[63,19,63,21],[63,25,63,26],[63,27,63,29],[63,30,63,32],[60,3,60,18],[60,19,60,21],[60,25,60,26],[60,27,60,29],[60,30,60,32],[61,3,61,18],[61,19,61,21],[61,25,61,26],[61,27,61,29],[61,30,61,32],[58,33,59,33],[59,3,59,15],[59,16,59,18],[59,19,59,21],[59,25,59,26],[59,27,59,29],[59,30,59,32],[54,1,54,2],[54,3,54,7],[54,8,54,12],[54,13,54,17],[55,1,55,2],[55,3,55,7],[55,8,55,12],[55,13,55,17],[50,14,50,16],[50,17,50,18],[52,1,52,7],[52,8,52,17],[53,1,53,2],[53,3,53,7],[53,8,53,12],[48,1,49,2],[48,3,48,8],[48,10,48,12],[49,3,49,8],[49,10,49,12],[50,1,50,2],[50,4,50,6],[50,9,50,11],[45,3,45,8],[45,10,45,12],[46,3,46,8],[46,10,46,12],[47,3,47,8],[47,10,47,12],[42,3,42,8],[42,10,42,12],[43,3,43,8],[43,10,43,12],[44,3,44,8],[44,10,44,12],[39,3,39,8],[39,10,39,12],[40,3,40,8],[40,10,40,12],[41,3,41,8],[41,10,41,12],[36,3,36,8],[36,10,36,12],[37,3,37,8],[37,10,37,12],[38,3,38,8],[38,10,38,12],[34,1,34,2],[34,3,34,8],[34,10,34,12],[35,3,35,8],[35,10,35,12],[30,3,30,8],[30,10,30,12],[31,3,31,8],[31,10,31,12],[32,3,32,8],[32,10,32,12],[29,1,29,23],[27,3,27,8],[27,9,27,14],[27,15,27,16],[27,17,27,19],[27,20,27,21],[27,23,27,24],[33,3,33,8],[33,10,33,12],[26,20,26,22],[26,23,26,24],[26,25,26,26],[26,27,26,32],[27,25,27,26],[27,27,27,32],[28,4,28,6],[28,7,28,22],[28,23,28,32],[21,25,21,26],[21,27,21,32],[22,25,22,26],[22,27,22,32],[23,4,23,6],[23,7,23,22],[23,23,23,32],[25,1,28,1],[25,3,25,14],[25,15,25,16],[25,17,25,19],[25,20,25,22],[22,3,22,8],[22,9,22,14],[22,15,22,16],[22,17,22,19],[22,20,22,21],[22,23,22,24],[25,23,25,24],[25,25,25,26],[25,27,25,32],[26,3,26,14],[26,15,26,16],[26,17,26,19],[17,25,17,26],[17,27,17,32],[18,4,18,6],[18,7,18,22],[18,23,18,32],[20,1,23,1],[20,3,20,14],[20,15,20,16],[20,17,20,19],[20,20,20,22],[17,3,17,8],[17,9,17,14],[17,15,17,16],[17,17,17,19],[17,20,17,21],[17,23,17,24],[20,23,20,24],[20,25,20,26],[20,27,20,32],[21,3,21,14],[21,15,21,16],[21,17,21,19],[21,20,21,22],[21,23,21,24],[15,25,15,26],[15,27,15,32],[16,3,16,14],[16,15,16,16],[16,17,16,19],[16,20,16,22],[16,23,16,24],[16,25,16,26],[16,27,16,32],[12,23,12,24],[15,1,18,1],[15,3,15,14],[15,15,15,16],[15,17,15,19],[15,20,15,22],[12,3,12,8],[12,9,12,14],[12,15,12,16],[12,17,12,19],[12,20,12,21],[15,23,15,24],[4,19,5,20],[4,21,5,26],[5,1,5,2],[7,4,7,26],[10,1,13,1],[10,3,10,14],[10,15,10,16],[10,17,10,19],[10,20,10,22],[10,23,10,24],[10,25,10,26],[13,4,13,6],[13,7,13,22],[13,23,13,32],[10,27,10,32],[11,3,11,14],[11,15,11,16],[11,17,11,19],[11,20,11,22],[11,23,11,24],[11,25,11,26],[11,27,11,32],[12,25,12,26],[12,27,12,32]]}
[10]
[10]
[]
[]
[null,null,null,null,null,null,null,null,null,null,null,null,null,null,null,null,null,null,null,"申込日"]
[null,"2023年春",null,"申込書(採点なし)"]
[null,"「はじめにお読み下さい」の内容を承諾の上、以下の通り購入申込みを行います。"]
[null,null,null,null," "]
[null,"１．各担当者情報設定"]
[null,"ご担当者のご記入をお願いいたします。赤色は必須項目です"]
{"$rows_left_out":126}
{"sheet":"採点付","index":2,"n_rows":135,"n_cols":47,"rows_kept":135,"cut":false,"hidden":false,"merged":[[107,25,107,26],[108,25,108,26],[114,25,114,26],[115,25,115,26],[116,25,116,26],[134,20,134,22],[133,25,133,27],[134,25,134,27],[133,28,133,32],[134,28,134,32],[130,30,130,32],[121,27,121,29],[121,30,121,32],[121,19,121,21],[121,22,121,24],[121,25,121,26],[128,27,128,29],[128,30,128,32],[123,25,123,26],[123,27,123,29],[123,30,123,32],[124,25,124,26],[124,27,124,29],[109,19,109,21],[131,10,131,12],[131,14,131,32],[132,5,132,8],[132,10,132,12],[132,14,132,32],[129,1,129,16],[129,17,130,20],[129,27,129,29],[129,30,129,32],[130,2,130,16],[130,27,130,29],[129,21,129,22],[130,21,130,22],[131,4,131,8],[128,1,128,9],[128,17,128,20],[128,21,128,22],[120,27,120,29],[120,30,120,32],[122,21,122,32],[34,1,34,2],[29,1,29,23],[134,1,134,3],[134,4,134,7],[134,8,134,11],[134,12,134,15],[134,16,134,19],[133,1,133,3],[133,4,133,7],[133,8,133,11],[133,12,133,15],[133,16,133,19],[121,3,121,15],[121,16,121,18],[116,19,116,21],[131,1,132,2],[120,19,120,21],[120,25,120,26],[118,3,118,18],[119,3,119,18],[120,3,120,18],[119,19,119,21],[119,27,119,29],[124,30,124,32],[125,25,125,26],[125,27,125,29],[125,30,125,32],[119,30,119,32],[118,19,118,21],[118,27,118,29],[118,30,118,32],[118,25,118,26],[119,25,119,26],[124,19,124,22],[123,19,123,22],[125,19,125,22],[122,1,122,18],[123,1,126,18],[117,3,117,18],[116,27,116,29],[116,30,116,32],[115,19,115,21],[115,27,115,29],[115,30,115,32],[117,19,117,21],[117,27,117,29],[117,30,117,32],[115,3,115,18],[117,25,117,26],[116,3,116,18],[106,30,106,32],[61,25,61,26],[62,25,62,26],[106,27,106,29],[114,19,114,21],[114,27,114,29],[106,19,106,21],[107,19,107,21],[107,27,107,29],[107,30,107,32],[64,30,64,32],[105,19,105,21],[105,27,105,29],[105,30,105,32],[64,19,64,21],[64,27,64,29],[114,30,114,32],[108,19,108,21],[108,27,108,29],[108,30,108,32],[63,25,63,26],[64,25,64,26],[105,25,105,26],[106,25,106,26],[62,30,62,32],[63,19,63,21],[63,27,63,29],[63,30,63,32],[62,19,62,21],[62,27,62,29],[61,19,61,21],[61,27,61,29],[61,30,61,32],[75,25,75,26],[75,27,75,29],[75,30,75,32],[76,19,76,21],[76,25,76,26],[76,27,76,29],[76,30,76,32],[77,19,77,21],[77,25,77,26],[77,27,77,29],[77,30,77,32],[75,19,75,21],[60,27,60,29],[58,33,59,33],[59,19,59,21],[59,27,59,29],[59,30,59,32],[59,3,59,15],[59,16,59,18],[60,30,60,32],[59,25,59,26],[60,25,60,26],[60,3,60,18],[60,19,60,21],[50,9,50,11],[50,14,50,16],[50,17,50,18],[54,13,54,17],[55,13,55,17],[53,1,53,2],[54,1,54,2],[55,1,55,2],[53,3,53,7],[54,3,54,7],[55,3,55,7],[52,1,52,7],[52,8,52,17],[53,8,53,12],[54,8,54,12],[55,8,55,12],[50,1,50,2],[50,4,50,6],[47,3,47,8],[47,10,47,12],[48,1,49,2],[48,3,48,8],[48,10,48,12],[49,3,49,8],[49,10,49,12],[44,3,44,8],[44,10,44,12],[45,3,45,8],[45,10,45,12],[46,3,46,8],[46,10,46,12],[41,3,41,8],[41,10,41,12],[42,3,42,8],[42,10,42,12],[43,3,43,8],[43,10,43,12],[38,3,38,8],[38,10,38,12],[39,3,39,8],[39,10,39,12],[40,3,40,8],[40,10,40,12],[34,10,34,12],[35,3,35,8],[35,10,35,12],[36,3,36,8],[36,10,36,12],[37,3,37,8],[37,10,37,12],[30,3,30,8],[30,10,30,12],[31,3,31,8],[31,10,31,12],[32,3,32,8],[32,10,32,12],[33,3,33,8],[33,10,33,12],[34,3,34,8],[26,20,26,22],[26,23,26,24],[26,25,26,26],[26,27,26,32],[27,25,27,26],[27,27,27,32],[28,4,28,6],[28,7,28,22],[28,23,28,32],[27,3,27,8],[27,9,27,14],[27,15,27,16],[27,17,27,19],[27,20,27,21],[27,23,27,24],[21,25,21,26],[21,27,21,32],[22,25,22,26],[22,27,22,32],[23,4,23,6],[23,7,23,22],[23,23,23,32],[25,1,28,1],[25,3,25,14],[25,15,25,16],[25,17,25,19],[25,20,25,22],[22,3,22,8],[22,9,22,14],[22,15,22,16],[22,17,22,19],[22,20,22,21],[22,23,22,24],[25,23,25,24],[25,25,25,26],[25,27,25,32],[26,3,26,14],[26,15,26,16],[26,17,26,19],[17,25,17,26],[17,27,17,32],[18,4,18,6],[18,7,18,22],[18,23,18,32],[20,1,23,1],[20,3,20,14],[20,15,20,16],[20,17,20,19],[20,20,20,22],[17,3,17,8],[17,9,17,14],[17,15,17,16],[17,17,17,19],[17,20,17,21],[17,23,17,24],[20,23,20,24],[20,25,20,26],[20,27,20,32],[21,3,21,14],[21,15,21,16],[21,17,21,19],[21,20,21,22],[21,23,21,24],[15,25,15,26],[15,27,15,32],[16,3,16,14],[16,15,16,16],[16,17,16,19],[16,20,16,22],[16,23,16,24],[16,25,16,26],[16,27,16,32],[12,23,12,24],[15,1,18,1],[15,3,15,14],[15,15,15,16],[15,17,15,19],[15,20,15,22],[12,3,12,8],[12,9,12,14],[12,15,12,16],[12,17,12,19],[12,20,12,21],[15,23,15,24],[4,19,5,20],[4,21,5,26],[7,4,7,26],[10,1,13,1],[10,3,10,14],[10,15,10,16],[10,17,10,19],[10,20,10,22],[10,23,10,24],[10,25,10,26],[13,4,13,6],[13,7,13,22],[13,23,13,32],[5,1,5,2],[10,27,10,32],[11,3,11,14],[11,15,11,16],[11,17,11,19],[11,20,11,22],[11,23,11,24],[11,25,11,26],[11,27,11,32],[12,25,12,26],[12,27,12,32],[61,3,61,18],[62,3,62,18],[63,3,63,18],[64,3,64,18],[105,3,105,18],[106,3,106,18],[107,3,107,18],[108,3,108,18],[114,3,114,18],[75,3,75,18],[76,3,76,18],[77,3,77,18],[78,3,78,18],[101,3,101,18],[103,3,103,18],[65,3,65,18],[67,3,67,18],[69,3,69,18],[71,3,71,18],[73,3,73,18],[109,3,109,18],[111,3,111,18],[113,3,113,18],[82,3,82,18],[78,25,78,26],[78,27,78,29],[78,30,78,32],[79,3,79,18],[79,19,79,21],[79,25,79,26],[79,27,79,29],[79,30,79,32],[100,3,100,18],[100,19,100,21],[100,25,100,26],[100,27,100,29],[100,30,100,32],[78,19,78,21],[80,3,80,18],[80,19,80,21],[80,25,80,26],[80,27,80,29],[80,30,80,32],[81,3,81,18],[81,19,81,21],[81,25,81,26],[81,27,81,29],[81,30,81,32],[101,19,101,21],[101,25,101,26],[101,27,101,29],[101,30,101,32],[102,3,102,18],[102,19,102,21],[102,25,102,26],[102,27,102,29],[102,30,102,32],[103,19,103,21],[103,25,103,26],[103,27,103,29],[103,30,103,32],[104,3,104,18],[104,19,104,21],[104,25,104,26],[104,27,104,29],[104,30,104,32],[65,19,65,21],[65,25,65,26],[65,27,65,29],[65,30,65,32],[66,3,66,18],[66,19,66,21],[66,25,66,26],[66,27,66,29],[66,30,66,32],[67,19,67,21],[67,25,67,26],[67,27,67,29],[67,30,67,32],[68,3,68,18],[68,19,68,21],[68,25,68,26],[68,27,68,29],[68,30,68,32],[69,19,69,21],[69,25,69,26],[69,27,69,29],[69,30,69,32],[70,3,70,18],[70,19,70,21],[70,25,70,26],[70,27,70,29],[70,30,70,32],[71,19,71,21],[71,25,71,26],[71,27,71,29],[71,30,71,32],[72,3,72,18],[72,19,72,21],[72,25,72,26],[72,27,72,29],[72,30,72,32],[73,19,73,21],[73,25,73,26],[73,27,73,29],[73,30,73,32],[74,3,74,18],[74,19,74,21],[74,25,74,26],[74,27,74,29],[74,30,74,32],[109,25,109,26],[109,27,109,29],[109,30,109,32],[110,3,110,18],[110,19,110,21],[110,25,110,26],[110,27,110,29],[110,30,110,32],[82,19,82,21],[82,25,82,26],[82,27,82,29],[82,30,82,32],[83,3,83,18],[83,19,83,21],[83,25,83,26],[83,27,83,29],[83,30,83,32],[84,3,84,18],[84,19,84,21],[84,25,84,26],[84,27,84,29],[84,30,84,32],[85,3,85,18],[85,19,85,21],[85,25,85,26],[85,27,85,29],[85,30,85,32],[86,3,86,18],[86,19,86,21],[86,25,86,26],[86,27,86,29],[86,30,86,32],[87,3,87,18],[87,19,87,21],[87,25,87,26],[87,27,87,29],[87,30,87,32],[88,3,88,18],[88,19,88,21],[88,25,88,26],[88,27,88,29],[88,30,88,32],[89,3,89,18],[89,19,89,21],[89,25,89,26],[89,27,89,29],[89,30,89,32],[90,3,90,18],[90,19,90,21],[90,25,90,26],[90,27,90,29],[90,30,90,32],[91,3,91,18],[91,19,91,21],[91,25,91,26],[91,27,91,29],[91,30,91,32],[92,3,92,18],[92,19,92,21],[92,25,92,26],[92,27,92,29],[92,30,92,32],[93,3,93,18],[93,19,93,21],[93,25,93,26],[93,27,93,29],[93,30,93,32],[94,3,94,18],[94,19,94,21],[94,25,94,26],[94,27,94,29],[94,30,94,32],[95,3,95,18],[95,19,95,21],[95,25,95,26],[95,27,95,29],[95,30,95,32],[96,3,96,18],[96,19,96,21],[96,25,96,26],[96,27,96,29],[96,30,96,32],[97,3,97,18],[97,19,97,21],[97,25,97,26],[97,27,97,29],[97,30,97,32],[136,2,136,25],[98,3,98,18],[98,19,98,21],[98,25,98,26],[98,27,98,29],[98,30,98,32],[99,3,99,18],[99,19,99,21],[99,25,99,26],[99,27,99,29],[99,30,99,32],[113,19,113,21],[113,25,113,26],[113,27,113,29],[113,30,113,32],[111,19,111,21],[111,25,111,26],[111,27,111,29],[111,30,111,32],[112,3,112,18],[112,19,112,21],[112,25,112,26],[112,27,112,29],[112,30,112,32]]}
[10]
[]
[]
[]
[null,null,null,null,null,null,null,null,null,null,null,null,null,null,null,null,null,null,null,"申込日"]
[null,"2023年春",null,"申込書(採点付き)"]
[null,"「はじめにお読み下さい」の内容を承諾の上、以下の通り購入申込みを行います。"]
[null,null,null,null," "]
[null,"１．各担当者情報設定"]
[null,"ご担当者のご記入をお願いいたします。赤色は必須項目です"]
{"$rows_left_out":126}
{"sheet":"採点付(名簿) ","index":3,"n_rows":513,"n_cols":23,"rows_kept":513,"cut":false,"hidden":false,"merged":[[5,20,9,20],[5,21,9,21],[5,22,9,22],[9,14,9,19],[5,13,5,19],[6,14,6,19],[5,12,6,12],[5,1,9,1],[5,2,9,2],[5,3,10,3],[5,4,9,4],[5,5,9,5],[5,11,6,11],[5,6,5,10]]}
[20,null,null,null,{"$f":"IF(採点付!K31=\"個人\",\"必須項目をご記入ください\",\"必要事項をご記入ください\")","v":"必要事項をご記入ください"},null,null,null,null,null,null,null,null,{"$f":"IF(採点付!K31=\"個人\",\"　\",\"↓ご担当者様一括送付のため、『送付先選択』および、『教材送付先』のご記入は不要です\")","v":"↓ご担当者様一括送付のため、『送付先選択』および、『教材送付先』のご記入は不要です"}]
[1,2,3,4,5,6,"1900-01-07","1900-01-08","1900-01-09","1900-01-10",11,12,13,14,15,16,17,18,19,20,21,22,23]
[null,{"$f":"採点付!K31","v":"選択してください↓"},null,""]
[null,null,null,null,null,null,"の項目は必須項目です"]
[null,null,null,null," 「はじめにお読み下さい」シート内の「個人情報のお取扱いについて」を募集時に周知いただくと共に、ご承諾を得てお申込みをお願いいたします。"]
[null,"氏名","フリガナ","No.","商品名（コース・教材）","コード(半角）","受講者情報登録　",null,null,null,null,"模試受験地の指定\n※23春は自宅・会社のみ\n※FE/SG（オンライン）は9：オンラインを選択してください","言語選択\n※基本情報技術者コース選択者のみ","個別発送の宛先",null,null,null,null,null,null,"社員番号","備考1","備考2"]
[null,null,null,null,null,null,"姓","名","セイ","メイ","メールアドレス",null,null,"送付先選択","教 材 送 付 先"]
[null,null,null,null,null,null,null,null,null,null,null,"1：自宅・会社","02：C言語","1：自宅","自宅〒","自宅住所１","自宅住所２","連絡先電話番号","×","×"]
[null,null,null,null,null,null,null,null,null,null,null,"2：東京会場","03：CASLⅡ","2：勤務先","勤務先〒","勤務先住所１","勤務先住所２","勤務先電話","会社名","部署名"]
[null,null,null,null,null,null,null,null,null,null,null,"3：大阪会場","04：JAVA"]
{"$rows_left_out":504}
{"sheet":"商品一覧 (公開模試)","index":4,"n_rows":23,"n_cols":16,"rows_kept":23,"cut":false,"hidden":true,"merged":[[12,0,12,6]]}
["2023年春期　公開模試採点付　商品一覧",null,null,null,null,"割引率"]
[null,null,null,null,null,5,"％引き"]
["商品コード","商品名","種別・分類","標準価格\n（税抜）","標準価格\n（税込）","御社価格\n（税抜）","御社価格\n（税込）","宿題メール配信時期","ECサイトURL(貼り付け用）","ECサイトURL","ECサイト\n発売予定日\n(非表示）","ECサイト\n発売予定日","商品\nパターン","商品カテゴリ","送料\nフラグ","登録項目"]
[501097,"２０２３上期　基本情報技術者　全国統一模擬試験（オンライン）","FE",4000,{"$f":"ROUNDDOWN(D4*110%,0)","v":4400},{"$f":"ROUNDDOWN($D4*(100-$F$2)%,0)","v":3800},{"$f":"ROUNDDOWN($E4*(100-$F$2)%,0)","v":4180},null,"https://www.itec.co.jp/store/products/detail.php?product_id=3247",{"$f":"IF(L4=\"\",I4,IF(L4=\"発売中\",HYPERLINK(I4),\"発売開始までお待ちください\"))","v":"発売開始までお待ちください"},"12 月上旬","12月上旬",28,{"$f":"IFERROR(VLOOKUP($M4,商品パターン!$A:$E,3,FALSE),\"\")","v":"Web完結模擬試験"},{"$f":"IFERROR(VLOOKUP($M4,商品パターン!$A:$E,4,FALSE),\"\")","v":"ー"},{"$f":"IFERROR(VLOOKUP($M4,商品パターン!$A:$E,5,FALSE),\"\")","v":"受講者情報登録・成績管理者設定"}]
[501094,"２０２３　情報セキュリティマネジメント　全国統一模擬試験（オンライン）","SG",4000,4400,3800,4180,null,"https://www.itec.co.jp/store/products/detail.php?product_id=3250",{"$f":"IF(L5=\"\",I5,IF(L5=\"発売中\",HYPERLINK(I5),\"発売開始までお待ちください\"))","v":"発売開始までお待ちください"},"12 月上旬","12月上旬",28,{"$f":"IFERROR(VLOOKUP($M5,商品パターン!$A:$E,3,FALSE),\"\")","v":"Web完結模擬試験"},{"$f":"IFERROR(VLOOKUP($M5,商品パターン!$A:$E,4,FALSE),\"\")","v":"ー"},{"$f":"IFERROR(VLOOKUP($M5,商品パターン!$A:$E,5,FALSE),\"\")","v":"受講者情報登録・成績管理者設定"}]
[501103,"２０２３春　応用情報技術者　全国統一公開模試　（採点付）","AP",6400,7040,{"$f":"ROUNDDOWN($D6*(100-$F$2)%,0)","v":6080},{"$f":"ROUNDDOWN($E6*(100-$F$2)%,0)","v":6688},null,"https://www.itec.co.jp/store/products/detail.php?product_id=3248",{"$f":"IF(L6=\"\",I6,IF(L6=\"発売中\",HYPERLINK(I6),\"発売開始までお待ちください\"))","v":"発売開始までお待ちください"},"12 月上旬","12月上旬",13,{"$f":"IFERROR(VLOOKUP($M6,商品パターン!$A:$E,3,FALSE),\"\")","v":"採点付・受験地"},{"$f":"IFERROR(VLOOKUP($M6,商品パターン!$A:$E,4,FALSE),\"\")","v":"ー"},{"$f":"IFERROR(VLOOKUP($M6,商品パターン!$A:$E,5,FALSE),\"\")","v":"受験地・受講者情報登録・お届先指定（一括・個別→宛先登録)・評価採点票送付先・成績管理者設定（ECサイト申込は備考欄に記入）"}]
[501105,"２０２３春　情報処理安全確保支援士　全国統一公開模試　（採点付）","SC",8000,8800,7600,8360,null,"https://www.itec.co.jp/store/products/detail.php?product_id=3249","発売開始までお待ちください","12 月上旬","12月上旬",13,{"$f":"IFERROR(VLOOKUP($M7,商品パターン!$A:$E,3,FALSE),\"\")","v":"採点付・受験地"},{"$f":"IFERROR(VLOOKUP($M7,商品パターン!$A:$E,4,FALSE),\"\")","v":"ー"},{"$f":"IFERROR(VLOOKUP($M7,商品パターン!$A:$E,5,FALSE),\"\")","v":"受験地・受講者情報登録・お届先指定（一括・個別→宛先登録)・評価採点票送付先・成績管理者設定（ECサイト申込は備考欄に記入）"}]
[501107,"２０２３　ネットワークスペシャリスト　全国統一公開模試　（採点付）","NW",8000,8800,7600,8360,null,"https://www.itec.co.jp/store/products/detail.php?product_id=3347","発売開始までお待ちください","12 月上旬","12月上旬",13,{"$f":"IFERROR(VLOOKUP($M8,商品パターン!$A:$E,3,FALSE),\"\")","v":"採点付・受験地"},{"$f":"IFERROR(VLOOKUP($M8,商品パターン!$A:$E,4,FALSE),\"\")","v":"ー"},{"$f":"IFERROR(VLOOKUP($M8,商品パターン!$A:$E,5,FALSE),\"\")","v":"受験地・受講者情報登録・お届先指定（一括・個別→宛先登録)・評価採点票送付先・成績管理者設定（ECサイト申込は備考欄に記入）"}]
[501109,"２０２３　ＩＴストラテジスト　全国統一公開模試　（採点付）","ST",10000,11000,9500,10450,null,"https://www.itec.co.jp/store/products/detail.php?product_id=3393","発売開始までお待ちください","12 月上旬","12月上旬",13,{"$f":"IFERROR(VLOOKUP($M9,商品パターン!$A:$E,3,FALSE),\"\")","v":"採点付・受験地"},{"$f":"IFERROR(VLOOKUP($M9,商品パターン!$A:$E,4,FALSE),\"\")","v":"ー"},{"$f":"IFERROR(VLOOKUP($M9,商品パターン!$A:$E,5,FALSE),\"\")","v":"受験地・受講者情報登録・お届先指定（一括・個別→宛先登録)・評価採点票送付先・成績管理者設定（ECサイト申込は備考欄に記入）"}]
[501111,"２０２３　システムアーキテクト　全国統一公開模試　（採点付）","SA",10000,11000,9500,10450,null,"https://www.itec.co.jp/store/products/detail.php?product_id=3366","発売開始までお待ちください","12 月上旬","12月上旬",13,{"$f":"IFERROR(VLOOKUP($M10,商品パターン!$A:$E,3,FALSE),\"\")","v":"採点付・受験地"},{"$f":"IFERROR(VLOOKUP($M10,商品パターン!$A:$E,4,FALSE),\"\")","v":"ー"},{"$f":"IFERROR(VLOOKUP($M10,商品パターン!$A:$E,5,FALSE),\"\")","v":"受験地・受講者情報登録・お届先指定（一括・個別→宛先登録)・評価採点票送付先・成績管理者設定（ECサイト申込は備考欄に記入）"}]
{"$rows_left_out":14}
{"sheet":"商品パターン","index":5,"n_rows":31,"n_cols":5,"rows_kept":31,"cut":false,"hidden":true,"merged":[]}
[]
[]
["項番","商品例","商品カテゴリ","送料フラグ","登録項目"]
[1,"IP模擬試験（WEB版）・FE　AP高度共通午前レベルチェックテスト","Web完結テスト","ー","受講者情報登録・成績管理者設定"]
[2,"IP・AP・高度　プラクティスコース\n初ＡＰ受験者向け　Ｌ３テクノロジ系基礎知識習得コース","情処対策（修了証無・模試無）","ー","受講者情報登録・成績管理者設定"]
[3,"AP高度　プラクティスコース　（模試付）","情処対策（修了証無・模試有）","ー","受験地・受講者情報登録・お届先指定（一括・個別→宛先登録)・評価採点票送付先・成績管理者設定"]
[4,"IP　スタンダードコース\n論文対策コース　（模試なし）","情処対策（修了証有・模試無）","ー","受講者情報登録・お届先指定（一括・個別→宛先登録)・成績管理者設定・修了証送付先・修了条件"]
[5,"APプレミアム　SGAP高度スタンダード　\nAP午後　高度午前Ⅰ免除　高度午後Ⅰ・Ⅱ　論文対策コース","情処対策（修了証有・模試有）","ー","受験地・受講者情報登録・お届先指定（一括・個別→宛先登録)・評価採点票送付先・成績管理者設定・修了証送付先・修了条件"]
[6,"FE　プラクティスコース","FE対策（修了証無・模試無）","ー","受講者情報登録・成績管理者設定・成績管理者設定"]
[7,"FE　プラクティスコース　（模試付）","FE対策（修了証無・模試有）","ー","受験地・受講者情報登録・お届先指定（一括・個別→宛先登録)・評価採点票送付先・成績管理者設定"]
{"$rows_left_out":22}
{"sheet":"発売日関数用","index":6,"n_rows":70,"n_cols":4,"rows_kept":70,"cut":false,"hidden":true,"merged":[]}
["リストの値","日にち設定","表示する値"]
["8月初旬","2022-08-02",{"$f":"IF(B2>$B$43,A2,\"発売中\")","v":"発売中"},"第1週火曜日"]
["8月上旬","2022-08-05","発売中","第1週金曜日"]
["8月中旬","2022-08-15","発売中","第3週月曜日"]
["8月下旬","2022-08-22","発売中","第4週月曜日"]
["9月初旬","2022-09-02","発売中","第1週金曜日"]
["9月上旬","2022-09-05","発売中","第1週月曜日"]
["9月中旬","2022-09-12","発売中","第2週月曜日"]
["9月下旬","2022-09-20","発売中","第3週月曜日が祝日の為、翌火曜日"]
["10月上旬","2022-10-03","発売中","第1週月曜日"]
{"$rows_left_out":60}